ثابت دی‌الکتریک
type: Concept
broader: ثابت
preferred label: dielectric constant @en
scope note: ملاکی برای اندازه‌گیری اثر محیط بر پتانسیل برهم‌کنش دو بار الکتریکی که ازطریق مقایسۀ ظرفیت یک خازن در مجاورت نمونه و نیز بدون آن به دست می‌آید.

ثابت
type: Concept
narrower: ثابت دی‌الکتریک
preferred label: constant @en