ثابت تن‌دهی
type: Concept
broader: ثابت کشسانی
preferred label: compliance constant @en
scope note: ضریبی که در قانون تعمیم‌یافتۀ هوک ظاهر می‌شود و ارتباط بین تنش و کُرنش را در جسم نشان می‌دهد.

ثابت کشسانی
type: Concept
narrower: ثابت تن‌دهی
preferred label: elastic constant @en