ثابت سفتی
type: Concept
broader: ثابت کشسانی
preferred label: stiffness constant @en
scope note: ضریبی در قانون تعمیم‌یافتۀ هوک که به‌موجب آن تنش وارد بر جسم با کُرنش تولیدشده متناسب است.

ثابت کشسانی
type: Concept
narrower: ثابت سفتی
preferred label: elastic constant @en