ثابت توری فراصوتی
type: Concept
broader: ثابت
preferred label: ultrasonic grating constant @en
scope note: فاصلۀ بین گره‌های متوالی در امواج فراصوتی ایستاده که همانند توری اپتیکی عمل می‌کند.

ثابت
type: Concept
narrower: ثابت توری فراصوتی
preferred label: constant @en