پیشانه بازی
type: Concept
broader: پیشانه
preferred label: game console @en
scope note: پیشانه‌ای که مخصوص بازی‌های رایانه‌ای طراحی شده است.

پیشانه
type: Concept
narrower: پیشانه بازی
preferred label: console @en