ink jet printer
type: Concept
alternative label: bubble jet printer
broader: printer
preferred label: چاپگر جوهرافشان @fa
scope note: چاپگری که با پرتاب ذرات جوهر بر کاغذ نقش ایجاد کند. @fa

printer
type: Concept
narrower: ink jet printer
preferred label: چاپگر @fa