کاربرد باریکه لیزر
type: Concept
preferred label: laser beam application @en
related: چاپگر لیزری

چاپگر لیزری
type: Concept
broader: چاپگر
preferred label: laser printer @en
related: کاربرد باریکه لیزر
scope note: چاپگری که در آن از پرتوِ لیزر برای نشاندن جوهر بر کاغذ استفاده شود.

چاپگر
type: Concept
narrower: چاپگر لیزری
preferred label: printer @en