چاپگر اپتیکی
type: Concept
broader: چاپگر
preferred label: optical printer @en
scope note: دستگاهی برای چاپ فیلم یا جلوه‌های ویژه با استفاده از ابزارهای نوری/ اپتیکی

چاپگر
type: Concept
narrower: چاپگر اپتیکی
preferred label: printer @en