واسط برنامه‌سازی کاربردی
type: Concept
alternative label: میانای برنامه‌سازی کاربردی
broader: واسط رایانه‌ای
preferred label: application programming interface @en
scope note: مجموعه‌ای از اشیا که به برنامۀ کاربردی امکان می‌دهد با منابعی مانند سامانۀ عامل یا پرونده یا برنامۀ کاربردی دیگری ارتباط برقرار کند.

واسط رایانه‌ای
type: Concept
narrower: واسط برنامه‌سازی کاربردی
preferred label: computer interface @en