واسط نوشتاری
type: Concept
alternative label: میانای نوشتاری
broader: واسط کاربر
preferred label: command-line interface @en
scope note: نوعی میانا که در آن کاربر برای فرمان دادن باید آن را تایپ کند.

واسط کاربر
type: Concept
narrower: واسط نوشتاری
preferred label: user interface @en