صاف‌سازی
type: Concept
broader: نگاشتار رایانه‌ای
preferred label: antialiasing @en
scope note: در نگاشتار رایانه‌ای، صاف کردن خطوط دندانه‌دار و ناصاف بر روی نمایشگر

نگاشتار رایانه‌ای
type: Concept
narrower: صاف‌سازی
preferred label: computer graphics @en