دسترسی نایکنواخت به حافظه
type: Concept
alternative label: معماری حافظه نایکنواخت
broader: معماری حافظه
preferred label: non-uniform memory access @en
scope note: نوعی فنّاوری که گسترۀ عملکرد رایانه‌های سرویس‌دهندۀ چندپردازشی متقارن ‌را توسعه می‌دهد.

معماری حافظه
type: Concept
narrower: دسترسی نایکنواخت به حافظه
preferred label: memory architecture @en