مهندسی نرم‌افزار با رایانه
type: Concept
broader: رایانش مهندسی
preferred label: computer-aided software engineering @en
scope note: استفاده از رایانه در طراحی و تولید نرم‌افزار

رایانش مهندسی
type: Concept
narrower: مهندسی نرم‌افزار با رایانه
preferred label: engineering computing @en