تحلیل استنادی
type: Concept
broader: تحلیل اطلاعات
preferred label: citation analysis @en
scope note: روشی مبتنی بر محاسبۀ تعداد اسناد منتشرشده‌ای که به یک سند مشخص ارجاع داده می‌شوند.

تحلیل اطلاعات
type: Concept
narrower: تحلیل استنادی
preferred label: information analysis @en