خودناشری
type: Concept
broader: نشر
preferred label: self-publishing @en
scope note: نوعی نشر که در آن کلیۀ فعالیت‌های مربوط به چاپ و توزیع و فروش اثر با پدیدآور است.

نشر
type: Concept
narrower: خودناشری
preferred label: publishing @en