فشرده‌ساز ابرصوتی
type: Concept
broader: فشرده‌ساز محوری
preferred label: supersonic compressor @en
scope note: فشرده‌ساز محوری (axial compressor) که در آن سرعت شاره نسبت به طول کل پرّه‌های چرخانه یا پرّه‌های ایستانه یا هر دو اَبَرصوتی است و در هر مرحله، امواج ناشی از ضربه‌های مایل بیشترین فشار ممکن را ایجاد می‌کند.

فشرده‌ساز محوری
type: Concept
narrower: فشرده‌ساز ابرصوتی
preferred label: axial flow compressor @en