دنباله‌دار بلنددوره
type: Concept
broader: ستاره دنباله‌دار
preferred label: long-period comet @en
scope note: دنباله‌داری که دورۀ مداری آن بیش از دویست سال باشد.

ستاره دنباله‌دار
type: Concept
narrower: دنباله‌دار بلنددوره
preferred label: comet @en