تمیزکاری سطح
type: Concept
narrower: تمیزکاری برق‌کافتی
preferred label: surface cleaning @en

تمیزکاری برق‌کافتی
type: Concept
broader: تمیزکاری سطح
preferred label: electrocleaning @en
scope note: تمیزکاری سطوح فلزی با الکترود قرار دادن قطعۀ کار در یک محلول برقکاف، در نتیجۀ آزاد شدن حباب‌های گاز در مجاورت الکترود