خوردگی باکتریایی
type: Concept
broader: خوردگی
preferred label: bacterial corrosion @en
scope note: خوردگی حاصل از موادی مثل سولفوریک‌اسید یا آمونیاک که براثر فعالیت باکتری‌های خاصی تولید می‌شود.

خوردگی
type: Concept
narrower: خوردگی باکتریایی
preferred label: corrosion @en