خوردگی چنگاله‌ای
type: Concept
broader: خوردگی
preferred label: chelant corrosion @en
scope note: انحلال یا نازک شدن لوله‌های دیگ بخار که بیشتر در نواحی تحت تنش رخ می‌دهد و ناشی از غلظت بیش‌ازحد چنگاله‌های نمک سدیمی است که در مدتی طولانی برای واپایش حلاّلیت رسوب به کار رفته است.

خوردگی
type: Concept
narrower: خوردگی چنگاله‌ای
preferred label: corrosion @en