خوردگی برق‌کافتی
type: Concept
broader: خوردگی
preferred label: electrolytic corrosion @en
scope note: نوعی خوردگی که در نتیجۀ واکنش الکتروشیمیایی اتفاق می‌افتد.

خوردگی
type: Concept
narrower: خوردگی برق‌کافتی
preferred label: corrosion @en