خوردگی داغ
type: Concept
broader: خوردگی
preferred label: hot corrosion @en
scope note: خوردگی فلز در نتیجۀ تأثیر مشترک اکسایش و واکنش با ترکیبات گوگردی یا سایر آلودگی‌ها، از قبیل کلریدها، که باعث ایجاد نمک مذاب بر روی سطح فلز می‌شود.

خوردگی
type: Concept
narrower: خوردگی داغ
preferred label: corrosion @en