خوردگی ترش
type: Concept
broader: خوردگی
preferred label: sour corrosion @en
scope note: نوعی خوردگی که براثر وجود هیدروژن‌سولفید حل‌شده در آب به وجود می‌آید.

خوردگی
type: Concept
narrower: خوردگی ترش
preferred label: corrosion @en