خوردگی سولفیدی
type: Concept
broader: خوردگی
preferred label: sulfidic corrosion @en
scope note: نوعی خوردگی ناشی از ترکیب انواع سولفیدها با فلز در دمای بالا که موجب ایجاد محصولات سولفیدی میشود.

خوردگی
type: Concept
narrower: خوردگی سولفیدی
preferred label: corrosion @en