خوردگی بخاری
type: Concept
broader: خوردگی
preferred label: vapour corrosion @en
scope note: خوردگی ناشی از محیطی که در آن آلوده‌کننده‌های فرّار وجود دارد.

خوردگی
type: Concept
narrower: خوردگی بخاری
preferred label: corrosion @en