الکترونهشت
type: Concept
narrower: الکترونهشت آندی
preferred label: electrodeposition @en

الکترونهشت آندی
type: Concept
broader: الکترونهشت
preferred label: anodic electrodeposition @en
scope note: نوعی روش پوشش‌دهی که در آن قطعه به‌صورت آند در محلول قرار می‌گیرد.