الکترونهشت
type: Concept
narrower: الکترونهشت کاتدی
preferred label: electrodeposition @en

الکترونهشت کاتدی
type: Concept
broader: الکترونهشت
preferred label: cathodic electrodeposition @en
scope note: نوعی روش پوشش‌دهی که در آن قطعه به‌صورت کاتد در محلول قرار می‌گیرد.