بسپارش نامیزه‌ای
type: Concept
broader: بسپارش
preferred label: emulsion polymerization @en
scope note: نوعی واکنش بسپارش که در یکی از فازهای یک نامیزه انجام ‌می‌شود.

بسپارش
type: Concept
narrower: بسپارش نامیزه‌ای
preferred label: polymerization @en