بسپارش چندجزئی
type: Concept
broader: بسپارش
preferred label: multicomponent polymerization @en
scope note: هم‌بسپارش سه یا چند تکپار که با چند واکنش انتشاری و پایانشی همراه است.

بسپارش
type: Concept
narrower: بسپارش چندجزئی
preferred label: polymerization @en