بسپارش حلقه‌گشا
type: Concept
broader: بسپارش
preferred label: ring-opening polymerization @en
scope note: بسپارشی که ازطریق گشوده‌ شدن یک تکپار حلقوی انجام می‌شود و درنتیجه بسپاری به دست می‌آید که واحدهای تکراری آن با اتصالاتی یکسان به‌ هم وصل شده‌اند.

بسپارش
type: Concept
narrower: بسپارش حلقه‌گشا
preferred label: polymerization @en