بسپارش فضاویژه
type: Concept
broader: بسپارش
preferred label: stereospecific polymerization @en
scope note: فرایندی که به تشکیل بسپاری با مرتبۀ معینی از آرایش مولکول‌ها در فضا، مانند پلی‌پروپیلن تک‌سوآرایش، منجر می‌شود.

بسپارش
type: Concept
narrower: بسپارش فضاویژه
preferred label: polymerization @en