ویرایش نقشه
type: Concept
broader: نقشه‌نگاری
preferred label: map editing @en
scope note: اصلاح یا اضافه کردن یا کم‌ کردن نمادها و داده‌ها و حروف و ارقام و بازنگری کلی در محتوا و شکل نقشه پیش از چاپ

نقشه‌نگاری
type: Concept
narrower: ویرایش نقشه
preferred label: cartography @en