نقشه‌سازی حدنگاشتی
type: Concept
broader: نقشه‌سازی
preferred label: cadastral mapping @en
scope note: فرایند طراحی و ساخت نقشۀ مورد نیاز حدنگاری

نقشه‌سازی
type: Concept
narrower: نقشه‌سازی حدنگاشتی
preferred label: mapping @en