ترمز دیسکی
type: Concept
broader: ترمز
preferred label: disc brake @en
scope note: سامانۀ ترمزی که در آن نیروی وارد بر لنت ترمز به دیسک منتقل می‌شود.

ترمز
type: Concept
narrower: ترمز دیسکی
preferred label: brake @en