باریکه لیزر
type: Concept
preferred label: laser beam @en
related: هدایت باریکه

هدایت باریکه
type: Concept
alternative label: هدایت باریکه اپتیکی
preferred label: beam steering @en
related: باریکه لیزر
related: آرایه آنتن
scope note: for particle beam aspects, use "beam handling technique" or NTs @en

آرایه آنتن
type: Concept
preferred label: antenna array @en
related: هدایت باریکه