جرثقیل دوپایه‌بلند
type: Concept
broader: جرثقیل پایه‌بلند
preferred label: semi-portal crane @en

جرثقیل پایه‌بلند
type: Concept
broader: جرثقیل دروازه‌ای
narrower: جرثقیل دوپایه‌بلند
preferred label: portal crane @en
scope note: نوعی جرثقیل دروازه‌ای که بر پایه‌های بلند و قائم استوار است و واگن‌های قطار و کفی‌های حامل بارگُنج می‌توانند از زیر آن عبور کنند.

جرثقیل دروازه‌ای
type: Concept
narrower: جرثقیل پایه‌بلند
preferred label: gantry crane @en