جرثقیل کاسچنگی
type: Concept
broader: جرثقیل
preferred label: grab crane @en
scope note: نوعی جرثقیل مجهز به کاسچنگ که از آن برای بارگیری و تخلیۀ کالاهای فله‌ای استفاده می‌شود.

جرثقیل
type: Concept
narrower: جرثقیل کاسچنگی
preferred label: crane @en