جرثقیل قلاب‌دار
type: Concept
broader: جرثقیل
preferred label: lift crane @en
scope note: نوعی جرثقیل مجهز به قلاب که از آن برای عملیات تخلیه و بارگیری استفاده می‌شود

جرثقیل
type: Concept
narrower: جرثقیل قلاب‌دار
preferred label: crane @en