تجهیزات بارگیری
type: Concept
narrower: دوّار بارگیری
preferred label: loading equipment @en

دوّار بارگیری
type: Concept
broader: تجهیزات بارگیری
preferred label: loading winch @en
scope note: دوّاری که بر روی کامیون حمل‌ونقل نصب می‌شود و برای بار زدن گِرده‌بینه به کامیون از آن استفاده می‌شود.