افشانش فشاری
type: Concept
alternative label: افشانش هیدرولیک
broader: افشانش
preferred label: airless spraying @en
scope note: فرایندی که در آن پوش‌رنگ با فشار زیاد از یک روزنه به‌صورت ذرات ریز به بیرون رانده می‌شود.

افشانش
type: Concept
narrower: افشانش فشاری
preferred label: spraying @en