اتم مزیک
type: Concept
broader: اتم هادرونی
preferred label: mesic atom @en

اتم هادرونی
type: Concept
alternative label: اتم پادپروتون
broader: اتم بیگانه
narrower: اتم مزیک
preferred label: hadronic atom @en
scope note: سامانه‌ای هیدروژن‌گونه که در آن ذره‌ای هادرونی با بار منفی در میدان کولنیِ هسته‌ای معمولی به دام افتاده باشد و به دور آن بچرخد.

اتم بیگانه
type: Concept
narrower: اتم هادرونی
preferred label: exotic atom @en