اخترشناسی
type: Concept
preferred label: astronomy @en
related: باستان‌اخترشناسی

باستان‌اخترشناسی
type: Concept
alternative label: archaeoastronomy @en
preferred label: astroarchaeology @en
related: باستان‌شناسی
related: اخترشناسی
scope note: بررسی اخترشناسی قدیم با استفاده از بقایای باستان‌شناختی و همچنین بررسی باستان‌شناسی مواد برجای‌مانده از فعالیت‌های اخترشناسی یا تاریخ‌اخترشناسی

باستان‌شناسی
type: Concept
preferred label: archaeology @en
related: باستان‌اخترشناسی