باستان‌شناسی دریایی
type: Concept
broader: باستان‌شناسی
preferred label: maritime archaeology @en
scope note: زیرشاخه‌ای از باستان‌شناسی که به مطالعۀ علمی بقایای کشتی‌های غرق‌شده و دیگر آثار باقی‌مانده از تاریخ دریانوردی می‌پردازد.

باستان‌شناسی
type: Concept
narrower: باستان‌شناسی دریایی
preferred label: archaeology @en