فولاد پرکربن
type: Concept
broader: فولاد کربنی
preferred label: high carbon steel @en
scope note: فولادی که میزان کربن آن بیش از 0/5 درصد است.

فولاد کربنی
type: Concept
narrower: فولاد پرکربن
preferred label: carbon steel @en