دوپیرش
type: Concept
broader: پیرش
preferred label: double ageing @en
scope note: به‌کارگیری دو عملیات پیرش متفاوت و متوالی برای واپایی رسوب حاصل از زمینۀ اَبَر‌اشباع برای کسب خواص مطلوب

پیرش
type: Concept
narrower: دوپیرش
preferred label: ageing @en