سرداپیرش
type: Concept
broader: پیرش
preferred label: quench ageing @en
scope note: پیرش براثر سرد کردن سریع پس از عملیات حرارتی محلولی

پیرش
type: Concept
narrower: سرداپیرش
preferred label: ageing @en