سیال‌سازی
scope note: روشی که در آن با معلق کردن ذرات جامد در مایع یا گاز در حال حرکت ذرات جامد رفتاری مانند سیال پیدا می‌کنند.
related: بستر سیال
broader: فناوری شیمیایی
preferred label: fluidization @en
type: Concept

بستر سیال
preferred label: fluidised bed @en
type: Concept
related: سیال‌سازی

فناوری شیمیایی
preferred label: chemical technology @en
type: Concept
narrower: سیال‌سازی