یک‌سوساز
preferred label: rectifier @en
type: Concept
narrower: یک‌سوساز پیوندی

یک‌سوساز پیوندی
alternative label: junction diod @en
alternative label: دیود پیوندی
scope note: وسیله‌ای که با عبور دادن الکترون از پیوندگاه بین دو نیم‌رسانا با خواص الکتریکی مخالف تولید جریان مستقیم می‌کند.
broader: یک‌سوساز
preferred label: junction rectifier @en
type: Concept