radiative shift
preferred label: شیفت تابشی @fa
type: Concept
related: radiative correction

electromagnetic correction
preferred label: تصحیح الکترومغناطیسی @fa
type: Concept
related: radiative correction

radiative correction
scope note: "radiative correction" is distinguished in use from "electromagnetic correction" by application to atomic and molecular spectrum
related: radiative shift
related: electromagnetic correction
preferred label: اصلاح تابشی @fa
type: Concept