پوش‌رنگ شتکی
scope note: پوش‌رنگی که سطحی بافت‌دار، متشکل از نقاط یا قطرات بزرگ ایجاد می‌کند.
broader: پوش‌رنگ
preferred label: spatter paint @en
type: Concept

پوش‌رنگ
preferred label: paint @en
type: Concept
narrower: پوش‌رنگ شتکی